Target
D(3) dopamine receptor
Ligand
BDBM50132057
Substrate
Meas. Tech.
ChEMBL_62137 (CHEMBL675894)
Ki
0.33±n/a nM
Citation
 Hackling, AGhosh, RPerachon, SMann, AHöltje, HDWermuth, CGSchwartz, JCSippl, WSokoloff, PStark, H N-(omega-(4-(2-methoxyphenyl)piperazin-1-yl)alkyl)carboxamides as dopamine D2 and D3 receptor ligands. J Med Chem 46:3883-99 (2003)  
Target
Name:
D(3) dopamine receptor
Synonyms:
DOPAMINE D3 DRD3_HUMAN Dopamine D3 receptor (D3) Dopamine receptor Dopamine receptor D3
Type:
Mol. Mass.:
44243.43
Organism:
Homo sapiens (Human)
Description:
Residue:
400
  
Inhibitor
Name:
BDBM50132057
Synonyms:
CHEMBL1180430 N-{4-[4-(2-Methoxy-phenyl)-piperazin-1-yl]-butyl}-3-phenyl-acrylamide; oxalic acid
Type:
Small organic molecule
Emp. Form.:
C24H31N3O2
Mol. Mass.:
393.5218
SMILES:
COc1ccccc1N1CCN(CCCCNC(=O)\C=C\c2ccccc2)CC1
: