Target
5-hydroxytryptamine receptor 1A
Ligand
BDBM50132538
Substrate
Meas. Tech.
ChEBML_1121
Ki
56±n/a nM
Citation
 López-Rodríguez, MLBenhamú, BMorcillo, MJTejada, IAvila, DMarco, ISchiapparelli, LFrechilla, DDel Río, J Design and synthesis of new benzimidazole-arylpiperazine derivatives acting as mixed 5-HT1A/5-HT3 ligands. Bioorg Med Chem Lett 13:3177-80 (2003)  
Target
Name:
5-hydroxytryptamine receptor 1A
Synonyms:
5-HT-1A 5-HT1A 5-hydroxytryptamine receptor 1A (5HT1A) 5ht1a Htr1a Serotonin 1a (5-HT1a) receptor/Adrenergic receptor alpha-1 | Serotonin receptor 1A
Type:
G Protein-Coupled Receptor (GPCR)
Mol. Mass.:
46445.29
Organism:
Rattus norvegicus (rat)
Description:
Binding assays were performed using rat hippocampal membranes.
Residue:
422
  
Inhibitor
Name:
BDBM50132538
Synonyms:
2-[4-(2-Propoxy-phenyl)-piperazin-1-ylmethyl]-1H-benzoimidazole-4-carboxylic acid (1-aza-bicyclo[2.2.2]oct-3-yl)-amide | CHEMBL110549
Type:
Small organic molecule
Emp. Form.:
C29H38N6O2
Mol. Mass.:
502.651
SMILES:
CCCOc1ccccc1N1CCN(Cc2nc3cccc(C(=O)NC4CN5CCC4CC5)c3[nH]2)CC1
: