Target
D(2) dopamine receptor
Ligand
BDBM50099814
Substrate
Meas. Tech.
ChEMBL_60054 (CHEMBL872881)
Ki
150±n/a nM
Citation
 Einsiedel, JWeber, KThomas, CLehmann, THübner, HGmeiner, P Stereocontrolled dopamine receptor binding and subtype selectivity of clebopride analogues synthesized from aspartic acid. Bioorg Med Chem Lett 13:3293-6 (2003)  
Target
Name:
D(2) dopamine receptor
Synonyms:
D(2) dopamine receptor DOPAMINE D2 Long DRD2 Dopamine D2 receptor Dopamine D2 receptor (D2R) Dopamine2-like | d2
Type:
Cell-surface receptors
Mol. Mass.:
50647.10
Organism:
Homo sapiens (Human)
Description:
P14416
Residue:
443
  
Inhibitor
Name:
BDBM50099814
Synonyms:
4-Bromo-1-methoxy-naphthalene-2-carboxylic acid ((R)-1-benzyl-pyrrolidin-3-yl)-amide CHEMBL298875
Type:
Small organic molecule
Emp. Form.:
C23H23BrN2O2
Mol. Mass.:
439.345
SMILES:
COc1c(cc(Br)c2ccccc12)C(=O)N[C@@H]1CCN(Cc2ccccc2)C1
: