Target
Corticotropin-releasing factor receptor 1
Ligand
BDBM50132951
Substrate
Meas. Tech.
ChEMBL_51285 (CHEMBL664987)
Ki
0.900000±n/a nM
Citation
 Huang, CQWilcoxen, KMcCarthy, JRHaddach, MWebb, TRGu, JXie, YFGrigoriadis, DEChen, C Synthesis and SAR of 8-arylquinolines as potent corticotropin-releasing factor1 (CRF1) receptor antagonists. Bioorg Med Chem Lett 13:3375-9 (2003)  
Target
Name:
Corticotropin-releasing factor receptor 1
Synonyms:
CRF-R CRF1 CRFR1 CRH-R 1 CRHR1 Corticotropin-releasing factor receptor 1 (CRF-1) Corticotropin-releasing hormone receptor 1
Type:
Enzyme
Mol. Mass.:
50744.31
Organism:
Homo sapiens (Human)
Description:
P34998
Residue:
444
  
Inhibitor
Name:
BDBM50132951
Synonyms:
8-(2,4-dichlorophenyl)-2-methyl-N,N-dipropylquinolin-4-amine [8-(2,4-Dichloro-phenyl)-2-methyl-quinolin-4-yl]-dipropyl-amine
Type:
Small organic molecule
Emp. Form.:
C22H24Cl2N2
Mol. Mass.:
387.345
SMILES:
CCCN(CCC)c1cc(C)nc2c(cccc12)-c1ccc(Cl)cc1Cl
: