Target
Kappa-type opioid receptor
Ligand
BDBM50079413
Substrate
Meas. Tech.
ChEMBL_145690 (CHEMBL753316)
EC50
515.0±n/a nM
Citation
 Vig, BSZheng, MQMurray, TFAldrich, JV Effects of the substitution of Phe4 in the opioid peptide [D-Ala8]dynorphin A-(1-11)NH2. J Med Chem 46:4002-8 (2003)  
Target
Name:
Kappa-type opioid receptor
Synonyms:
KOR-1 OPIATE Kappa Opioid receptor Ror-d
Type:
G Protein-Coupled Receptor (GPCR)
Mol. Mass.:
42692.90
Organism:
Rattus norvegicus (rat)
Description:
P34975
Residue:
380
  
Inhibitor
Name:
BDBM50079413
Synonyms:
CHEMBL407084 Tyr-Gly-Gly-Phe-Leu-Arg-Arg-D-Ala-Arg-Pro-Lys-NH2
Type:
Small organic molecule
Emp. Form.:
C60H98N22O12
Mol. Mass.:
1319.5603
SMILES:
CC(C)C[C@H](NC(=O)[C@H](Cc1ccccc1)NC(=O)CNC(=O)CNC(=O)[C@@H](N)Cc1ccc(O)cc1)C(=O)N[C@@H](CCCN=C(N)N)C(=O)N[C@@H](CCCN=C(N)N)C(=O)N[C@H](C)C(=O)N[C@@H](CCCN=C(N)N)C(=O)N1CCC[C@H]1C(=O)N[C@@H](CCCCN)C(N)=O
: