Target
Estrogen receptor beta
Ligand
BDBM50133070
Substrate
Meas. Tech.
ChEMBL_67202 (CHEMBL678290)
Ki
0.27±n/a nM
Citation
 Minutolo, FAntonello, MBertini, SOrtore, GPlacanica, GRapposelli, SSheng, SCarlson, KEKatzenellenbogen, BSKatzenellenbogen, JAMacchia, M Novel estrogen receptor ligands based on an anthranylaldoxime structure: role of the phenol-type pseudocycle in the binding process. J Med Chem 46:4032-42 (2003)  
Target
Name:
Estrogen receptor beta
Synonyms:
ER-beta ESR2_HUMAN Estradiol receptor beta (ERβ) Estrogen receptor (ER beta) Estrogen receptor beta (ER beta) NR3A2 estrogen beta
Type:
Protein
Mol. Mass.:
59238.43
Organism:
Homo sapiens (Human)
Description:
Q92731
Residue:
530
  
Inhibitor
Name:
BDBM50133070
Synonyms:
CHEMBL335465 | [1,1';2',1'']Terphenyl-4'-carbaldehyde oxime
Type:
Small organic molecule
Emp. Form.:
C19H15NO
Mol. Mass.:
273.3285
SMILES:
O=NCc1ccc(-c2ccccc2)c(c1)-c1ccccc1
: