Target
Estrogen receptor
Ligand
BDBM50133071
Substrate
Meas. Tech.
ChEMBL_67038 (CHEMBL677876)
Ki
1.1±n/a nM
Citation
 Minutolo, FAntonello, MBertini, SOrtore, GPlacanica, GRapposelli, SSheng, SCarlson, KEKatzenellenbogen, BSKatzenellenbogen, JAMacchia, M Novel estrogen receptor ligands based on an anthranylaldoxime structure: role of the phenol-type pseudocycle in the binding process. J Med Chem 46:4032-42 (2003)  
Target
Name:
Estrogen receptor
Synonyms:
ER ESR ESR1_HUMAN Estrogen receptor Estrogen receptor (ER-alpha) Estrogen receptor alpha (ER) Nuclear receptor subfamily 3 group A member 1
Type:
Protein
Mol. Mass.:
66230.44
Organism:
Homo sapiens (Human)
Description:
P03372
Residue:
595
  
Inhibitor
Name:
BDBM50133071
Synonyms:
3'-Hydroxy-[1,1';2',1'']terphenyl-4'-carbaldehyde oxime i3'-Hydroxy-[1,1';2',1'']terphenyl-4'-carbaldehyde oxime
Type:
Small organic molecule
Emp. Form.:
C19H15NO2
Mol. Mass.:
289.3279
SMILES:
Oc1c(CN=O)ccc(-c2ccccc2)c1-c1ccccc1
: