Target
Glutamate receptor ionotropic, NMDA 1
Ligand
BDBM50133104
Substrate
Meas. Tech.
ChEMBL_140872 (CHEMBL752503)
Ki
10600±n/a nM
Citation
 Baskin, IITikhonova, IGPalyulin, VAZefirov, NS Selectivity fields: comparative molecular field analysis (CoMFA) of the glycine/NMDA and AMPA receptors. J Med Chem 46:4063-9 (2003)  
Target
Name:
Glutamate receptor ionotropic, NMDA 1
Synonyms:
Glutamate (NMDA) receptor subunit zeta 1 Glutamate-NMDA-Channel Glutamate-NMDA-Polyamine NMDA Nmdar1 | phencyclidine
Type:
Enzyme Catalytic Domain
Mol. Mass.:
105533.40
Organism:
RAT
Description:
P35439
Residue:
938
  
Inhibitor
Name:
BDBM50133104
Synonyms:
8-Chloro-9-nitro-5,6-dihydro-pyrazolo[1,5-c]quinazoline-2,5-dicarboxylic acid 2-ethyl ester | CHEMBL131258
Type:
Small organic molecule
Emp. Form.:
C14H11ClN4O6
Mol. Mass.:
366.713
SMILES:
CCOC(=O)c1cc2-c3cc(c(Cl)cc3NC(C(O)=O)n2n1)[N+]([O-])=O
: