Target
Protein kinase C alpha type
Ligand
BDBM50133237
Substrate
Meas. Tech.
ChEMBL_162571 (CHEMBL768513)
Ki
296±n/a nM
Citation
 Sridhar, JWei, ZLNowak, ILewin, NEAyres, JAPearce, LVBlumberg, PMKozikowski, AP New bivalent PKC ligands linked by a carbon spacer: enhancement in binding affinity. J Med Chem 46:4196-204 (2003)  
Target
Name:
Protein kinase C alpha type
Synonyms:
KPCA_BOVIN PRKCA Protein kinase C alpha
Type:
Enzyme
Mol. Mass.:
76842.76
Organism:
Bos taurus (bovine)
Description:
Residue:
672
  
Inhibitor
Name:
BDBM50133237
Synonyms:
CHEMBL133777 | Nonanoic acid 4-((2S,4R)-2-hydroxymethyl-4-isopropyl-5-oxo-pyrrolidin-3-yl)-naphthalen-1-yl ester
Type:
Small organic molecule
Emp. Form.:
C27H37NO4
Mol. Mass.:
439.587
SMILES:
CCCCCCCCC(=O)Oc1ccc(C2[C@@H](CO)NC(=O)[C@@H]2C(C)C)c2ccccc12
: