Target
Protein kinase C alpha type
Ligand
BDBM50133251
Substrate
Meas. Tech.
ChEMBL_162571 (CHEMBL768513)
Ki
154±n/a nM
Citation
 Sridhar, JWei, ZLNowak, ILewin, NEAyres, JAPearce, LVBlumberg, PMKozikowski, AP New bivalent PKC ligands linked by a carbon spacer: enhancement in binding affinity. J Med Chem 46:4196-204 (2003)  
Target
Name:
Protein kinase C alpha type
Synonyms:
KPCA_BOVIN PRKCA Protein kinase C alpha
Type:
Enzyme
Mol. Mass.:
76842.76
Organism:
Bos taurus (bovine)
Description:
Residue:
672
  
Inhibitor
Name:
BDBM50133251
Synonyms:
CHEMBL336963 | Tetradecanedioic acid 4-(2-hydroxymethyl-4-isopropyl-5-oxo-pyrrolidin-3-yl)-naphthalen-1-yl ester naphthalen 4-(2-hydroxymethyl-4-isopropyl-5-oxo-pyrrolidin-3-yl)-1-yl ester
Type:
Small organic molecule
Emp. Form.:
C50H64N2O8
Mol. Mass.:
821.0518
SMILES:
CC(C)[C@@H]1C([C@@H](CO)NC1=O)c1ccc(OC(=O)CCCCCCCCCCCCC(=O)Oc2ccc([C@@H]3[C@@H](CO)NC(=O)[C@@H]3C(C)C)c3ccccc23)c2ccccc12
: