Target
Prothrombin
Ligand
BDBM50133519
Substrate
Meas. Tech.
ChEBML_208918
Ki
4.1±n/a nM
Citation
 Rittle, KEBarrow, JCCutrona, KJGlass, KLKrueger, JAKuo, LCLewis, SDLucas, BJMcMasters, DRMorrissette, MMNantermet, PGNewton, CLSanders, WMYan, YVacca, JPSelnick, HG Unexpected enhancement of thrombin inhibitor potency with o-aminoalkylbenzylamides in the P1 position. Bioorg Med Chem Lett 13:3477-82 (2003)  
Target
Name:
Prothrombin
Synonyms:
Activation peptide fragment 1 Coagulation factor II Prothrombin precursor Thrombin heavy chain | Thrombin light chain
Type:
Protein
Mol. Mass.:
70029.57
Organism:
Homo sapiens (Human)
Description:
P00734
Residue:
622
  
Inhibitor
Name:
BDBM50133519
Synonyms:
CHEMBL117387 | N-[2-(2-Amino-ethyl)-benzyl]-2-(6-methyl-2-oxo-3-phenylmethanesulfonylamino-2H-pyridin-1-yl)-acetamide
Type:
Small organic molecule
Emp. Form.:
C24H28N4O4S
Mol. Mass.:
468.569
SMILES:
Cc1ccc(NS(=O)(=O)Cc2ccccc2)c(=O)n1CC(=O)NCc1ccccc1CCN
: