Target
Transient receptor potential cation channel subfamily V member 1
Ligand
BDBM50133829
Substrate
Meas. Tech.
ChEMBL_215813 (CHEMBL820102)
IC50
479±n/a nM
Citation
 Sun, QTafesse, LIslam, KZhou, XVictory, SFZhang, CHachicha, MSchmid, LAPatel, ARotshteyn, YValenzano, KJKyle, DJ 4-(2-pyridyl)piperazine-1-carboxamides: potent vanilloid receptor 1 antagonists. Bioorg Med Chem Lett 13:3611-6 (2003)  
Target
Name:
Transient receptor potential cation channel subfamily V member 1
Synonyms:
Capsaicin receptor TRPV1_RAT Trpv1 Vanilloid VR1 Vanilloid receptor 1 (VRI/TRPV1) Vanilloid receptor type 1-like (TrpV1/Vr1) Vr1l | osm-9-like TRP channel 1
Type:
Transient Receptor
Mol. Mass.:
94956.12
Organism:
Rattus norvegicus (rat)
Description:
O35433
Residue:
838
  
Inhibitor
Name:
BDBM50133829
Synonyms:
4-(3-Chloro-pyridin-2-yl)-piperazine-1-carboxylic acid naphthalen-2-ylamide | CHEMBL120849
Type:
Small organic molecule
Emp. Form.:
C20H19ClN4O
Mol. Mass.:
366.844
SMILES:
Clc1cccnc1N1CCN(CC1)C(=O)Nc1ccc2ccccc2c1
: