Target
Transient receptor potential cation channel subfamily V member 1
Ligand
BDBM50133818
Substrate
Meas. Tech.
ChEMBL_215814 (CHEMBL820103)
IC50
57±n/a nM
Citation
 Sun, QTafesse, LIslam, KZhou, XVictory, SFZhang, CHachicha, MSchmid, LAPatel, ARotshteyn, YValenzano, KJKyle, DJ 4-(2-pyridyl)piperazine-1-carboxamides: potent vanilloid receptor 1 antagonists. Bioorg Med Chem Lett 13:3611-6 (2003)  
Target
Name:
Transient receptor potential cation channel subfamily V member 1
Synonyms:
Capsaicin receptor TRPV1_RAT Trpv1 Vanilloid VR1 Vanilloid receptor 1 (VRI/TRPV1) Vanilloid receptor type 1-like (TrpV1/Vr1) Vr1l | osm-9-like TRP channel 1
Type:
Transient Receptor
Mol. Mass.:
94956.12
Organism:
Rattus norvegicus (rat)
Description:
O35433
Residue:
838
  
Inhibitor
Name:
BDBM50133818
Synonyms:
4-(3-Chloro-pyridin-2-yl)-piperazine-1-carboxylic acid (4-ethyl-phenyl)-amide | CHEMBL413109
Type:
Small organic molecule
Emp. Form.:
C18H21ClN4O
Mol. Mass.:
344.839
SMILES:
CCc1ccc(NC(=O)N2CCN(CC2)c2ncccc2Cl)cc1
: