Target
Capsid scaffolding protein
Ligand
BDBM50133969
Substrate
Meas. Tech.
ChEMBL_158964 (CHEMBL769610)
Ki
15±n/a nM
Citation
 Borthwick, ADDavies, DEErtl, PFExall, AMHaley, TMHart, GJJackson, DLParry, NRPatikis, ATrivedi, NWeingarten, GGWoolven, JM Design and synthesis of pyrrolidine-5,5'-trans-lactams (5-oxo-hexahydropyrrolo[3,2-b]pyrroles) as novel mechanism-based inhibitors of human cytomegalovirus protease. 4. Antiviral activity and plasma stability. J Med Chem 46:4428-49 (2003)  
Target
Name:
Capsid scaffolding protein
Synonyms:
APNG Assembly protein Human cytomegalovirus protease (HCMV Pr) Protease precursor UL80 | pPR
Type:
PROTEIN
Mol. Mass.:
73854.16
Organism:
Human cytomegalovirus (strain AD169) (HHV-5) (Human herpesvirus 5)
Description:
ChEMBL_158958
Residue:
708
  
Inhibitor
Name:
BDBM50133969
Synonyms:
(S)-2-((3aS,6S,6aR)-4-Cyclopropanecarbonyl-6-methyl-5-oxo-hexahydro-pyrrolo[3,2-b]pyrrole-1-carbonyl)-pyrrolidine-1-carboxylic acid (4-trifluoromethyl-phenyl)-amide | CHEMBL138346
Type:
Small organic molecule
Emp. Form.:
C24H27F3N4O4
Mol. Mass.:
492.4908
SMILES:
C[C@H]1[C@@H]2[C@H](CCN2C(=O)[C@@H]2CCCN2C(=O)Nc2ccc(cc2)C(F)(F)F)N(C(=O)C2CC2)C1=O
: