Target
Melanocortin receptor 4
Ligand
BDBM50134951
Substrate
Meas. Tech.
ChEMBL_106358 (CHEMBL714438)
Ki
9.6±n/a nM
Citation
 Balse-Srinivasan, PGrieco, PCai, MTrivedi, DHruby, VJ Structure-activity relationships of gamma-MSH analogues at the human melanocortin MC3, MC4, and MC5 receptors. Discovery of highly selective hMC3R, hMC4R, and hMC5R analogues. J Med Chem 46:4965-73 (2003)  
Target
Name:
Melanocortin receptor 4
Synonyms:
MC4-R MC4R_HUMAN Melanocortin receptor 4 (MC-4) Melanocortin receptor 4 (MC4R)
Type:
Enzyme
Mol. Mass.:
36949.50
Organism:
Homo sapiens (Human)
Description:
P32245
Residue:
332
  
Inhibitor
Name:
BDBM50134951
Synonyms:
CHEMBL409636 | H-Tyr-Val-Nle-c[Asp-His-Phe-Arg-Trp-Lys]-Arg-Phe-Gly-NH2
Type:
Small organic molecule
Emp. Form.:
C79H109N23O14
Mol. Mass.:
1604.8565
SMILES:
CCCC[C@H](NC(=O)[C@@H](NC(=O)[C@@H](N)Cc1ccc(O)cc1)C(C)C)C(=O)N[C@H]1CC(=O)NCCCC[C@@H](NC(=O)[C@@H](Cc2c[nH]c3ccccc23)NC(=O)[C@H](CCCNC(N)=N)NC(=O)[C@@H](Cc2ccccc2)NC(=O)[C@H](Cc2cnc[nH]2)NC1=O)C(=O)N[C@@H](CCCNC(N)=N)C(=O)N[C@@H](Cc1ccccc1)C(=O)NCC(N)=O
: