Target
Glycogen phosphorylase, liver form
Ligand
BDBM50135556
Substrate
Meas. Tech.
ChEBML_70990
IC50
24±n/a nM
Citation
 Lu, ZBohn, JBergeron, RDeng, QEllsworth, KPGeissler, WMHarris, GMcCann, PEMcKeever, BMyers, RWSaperstein, RWilloughby, CAYao, JChapman, K A new class of glycogen phosphorylase inhibitors. Bioorg Med Chem Lett 13:4125-8 (2003)  
Target
Name:
Glycogen phosphorylase, liver form
Synonyms:
Glycogen phosphorylase, liver form Liver glycogen phosphorylase Pygl
Type:
PROTEIN
Mol. Mass.:
97489.46
Organism:
Rattus norvegicus
Description:
ChEMBL_1491377
Residue:
850
  
Inhibitor
Name:
BDBM50135556
Synonyms:
4-{2-[(4-Methoxy-pyridine-2-carbonyl)-amino]-phenoxy}-phthalic acid | CHEMBL131644
Type:
Small organic molecule
Emp. Form.:
C21H16N2O7
Mol. Mass.:
408.3609
SMILES:
COc1ccnc(c1)C(=O)Nc1ccccc1Oc1ccc(C(O)=O)c(c1)C(O)=O
: