Target
Farnesyl pyrophosphate synthase
Ligand
BDBM50135835
Substrate
Meas. Tech.
ChEMBL_69841 (CHEMBL857167)
IC50
427±n/a nM
Citation
 Sanders, JMGómez, AOMao, JMeints, GAVan Brussel, EMBurzynska, AKafarski, PGonzález-Pacanowska, DOldfield, E 3-D QSAR investigations of the inhibition of Leishmania major farnesyl pyrophosphate synthase by bisphosphonates. J Med Chem 46:5171-83 (2003)  
Target
Name:
Farnesyl pyrophosphate synthase
Synonyms:
Dimethylallyltranstransferase FPP synthase FPPS_HUMAN Farnesyl diphosphate synthase Farnesyl diphosphate synthetase Farnesyl pyrophosphate synthetase KIAA1293 | P14324
Type:
Enzyme
Mol. Mass.:
48272.89
Organism:
Homo sapiens (Human)
Description:
P14324
Residue:
419
  
Inhibitor
Name:
BDBM50135835
Synonyms:
(isoquinolin-1-ylamino)methylenediphosphonic acid CHEMBL291727 | [(ISOQUINOLIN-1-YLAMINO)-PHOSPHONO-METHYL]-PHOSPHONIC ACID
Type:
Small organic molecule
Emp. Form.:
C10H12N2O6P2
Mol. Mass.:
318.1596
SMILES:
OP(O)(=O)C(Nc1nccc2ccccc12)P(O)(O)=O
: