Target
Adenosine kinase
Ligand
BDBM50135894
Substrate
Meas. Tech.
ChEMBL_31127 (CHEMBL643555)
IC50
0.25±n/a nM
Citation
 Perner, RJGu, YGLee, CHBayburt, EKMcKie, JAlexander, KMKohlhaas, KLWismer, CTMikusa, JJarvis, MFKowaluk, EABhagwat, SS 5,6,7-trisubstituted 4-aminopyrido[2,3-d]pyrimidines as novel inhibitors of adenosine kinase. J Med Chem 46:5249-57 (2003)  
Target
Name:
Adenosine kinase
Synonyms:
ADENOSINE Adenosine 5-phosphotransferase Adenosine kinase | Adk
Type:
Enzyme
Mol. Mass.:
40130.14
Organism:
Rattus norvegicus (rat)
Description:
Rat brain cytosol as enzyme source.
Residue:
361
  
Inhibitor
Name:
BDBM50135894
Synonyms:
5,6-Bis-(3-fluoro-4-methyl-phenyl)-7-thiophen-2-yl-pyrido[2,3-d]pyrimidin-4-ylamine | CHEMBL150370
Type:
Small organic molecule
Emp. Form.:
C25H18F2N4S
Mol. Mass.:
444.499
SMILES:
Cc1ccc(cc1F)-c1c(nc2ncnc(N)c2c1-c1ccc(C)c(F)c1)-c1cccs1
: