Target
Adenosine kinase
Ligand
BDBM50135900
Substrate
Meas. Tech.
ChEMBL_31127 (CHEMBL643555)
IC50
0.55±n/a nM
Citation
 Perner, RJGu, YGLee, CHBayburt, EKMcKie, JAlexander, KMKohlhaas, KLWismer, CTMikusa, JJarvis, MFKowaluk, EABhagwat, SS 5,6,7-trisubstituted 4-aminopyrido[2,3-d]pyrimidines as novel inhibitors of adenosine kinase. J Med Chem 46:5249-57 (2003)  
Target
Name:
Adenosine kinase
Synonyms:
ADENOSINE Adenosine 5-phosphotransferase Adenosine kinase | Adk
Type:
Enzyme
Mol. Mass.:
40130.14
Organism:
Rattus norvegicus (rat)
Description:
Rat brain cytosol as enzyme source.
Residue:
361
  
Inhibitor
Name:
BDBM50135900
Synonyms:
5,6-Diphenyl-7-thiophen-2-yl-pyrido[2,3-d]pyrimidin-4-ylamine | CHEMBL348712
Type:
Small organic molecule
Emp. Form.:
C23H16N4S
Mol. Mass.:
380.465
SMILES:
Nc1ncnc2nc(-c3cccs3)c(-c3ccccc3)c(-c3ccccc3)c12
: