Target
Adenosine kinase
Ligand
BDBM50095358
Substrate
Meas. Tech.
ChEMBL_31115 (CHEMBL642226)
IC50
467±n/a nM
Citation
 Perner, RJGu, YGLee, CHBayburt, EKMcKie, JAlexander, KMKohlhaas, KLWismer, CTMikusa, JJarvis, MFKowaluk, EABhagwat, SS 5,6,7-trisubstituted 4-aminopyrido[2,3-d]pyrimidines as novel inhibitors of adenosine kinase. J Med Chem 46:5249-57 (2003)  
Target
Name:
Adenosine kinase
Synonyms:
ADK | ADK_HUMAN
Type:
PROTEIN
Mol. Mass.:
40545.97
Organism:
Homo sapiens (Human)
Description:
ChEMBL_1467841
Residue:
362
  
Inhibitor
Name:
BDBM50095358
Synonyms:
7-(4-Dimethylamino-phenyl)-5-phenyl-pyrido[2,3-d]pyrimidin-4-ylamine | CHEMBL68492
Type:
Small organic molecule
Emp. Form.:
C21H19N5
Mol. Mass.:
341.4091
SMILES:
CN(C)c1ccc(cc1)-c1cc(-c2ccccc2)c2c(N)ncnc2n1
: