Target
Adenosine kinase
Ligand
BDBM50135898
Substrate
Meas. Tech.
ChEMBL_31127 (CHEMBL643555)
IC50
3.2±n/a nM
Citation
 Perner, RJGu, YGLee, CHBayburt, EKMcKie, JAlexander, KMKohlhaas, KLWismer, CTMikusa, JJarvis, MFKowaluk, EABhagwat, SS 5,6,7-trisubstituted 4-aminopyrido[2,3-d]pyrimidines as novel inhibitors of adenosine kinase. J Med Chem 46:5249-57 (2003)  
Target
Name:
Adenosine kinase
Synonyms:
ADENOSINE Adenosine 5-phosphotransferase Adenosine kinase | Adk
Type:
Enzyme
Mol. Mass.:
40130.14
Organism:
Rattus norvegicus (rat)
Description:
Rat brain cytosol as enzyme source.
Residue:
361
  
Inhibitor
Name:
BDBM50135898
Synonyms:
7-(6-Dimethylamino-pyridin-3-yl)-5,6-diphenyl-pyrido[2,3-d]pyrimidin-4-ylamine | CHEMBL151448
Type:
Small organic molecule
Emp. Form.:
C26H22N6
Mol. Mass.:
418.4931
SMILES:
CN(C)c1ccc(cn1)-c1nc2ncnc(N)c2c(-c2ccccc2)c1-c1ccccc1
: