Target
Sodium-dependent serotonin transporter
Ligand
BDBM50136690
Substrate
Meas. Tech.
ChEBML_201368
Ki
2.2±n/a nM
Citation
 Bymaster, FPBeedle, EEFindlay, JGallagher, PTKrushinski, JHMitchell, SRobertson, DWThompson, DCWallace, LWong, DT Duloxetine (Cymbalta), a dual inhibitor of serotonin and norepinephrine reuptake. Bioorg Med Chem Lett 13:4477-80 (2003)  
Target
Name:
Sodium-dependent serotonin transporter
Synonyms:
5-HT Transporter 5HTT SC6A4_HUMAN SLC6A4 Serotonin transporter (5HTT) Sodium-dependent serotonin transporter (SERT) | Solute carrier family 6 member 4
Type:
Multi-pass membrane protein
Mol. Mass.:
70322.51
Organism:
Homo sapiens (Human)
Description:
P31645
Residue:
630
  
Inhibitor
Name:
BDBM50136690
Synonyms:
CHEMBL337791 | [3-(3-Methoxy-phenyl)-3-(naphthalen-1-yloxy)-propyl]-methyl-amine
Type:
Small organic molecule
Emp. Form.:
C21H23NO2
Mol. Mass.:
321.4128
SMILES:
CNCCC(Oc1cccc2ccccc12)c1cccc(OC)c1
: