Target
RNA-directed RNA polymerase
Ligand
BDBM50137478
Substrate
Meas. Tech.
ChEBML_143777
IC50
62000±n/a nM
Citation
 Beaulieu, PLBös, MBousquet, YFazal, GGauthier, JGillard, JGoulet, SLaPlante, SPoupart, MALefebvre, SMcKercher, GPellerin, CAustel, VKukolj, G Non-nucleoside inhibitors of the hepatitis C virus NS5B polymerase: discovery and preliminary SAR of benzimidazole derivatives. Bioorg Med Chem Lett 14:119-24 (2003)  
Target
Name:
RNA-directed RNA polymerase
Synonyms:
Hepatitis C virus NS5B RNA-dependent RNA polymerase | NS5B protein
Type:
Protein
Mol. Mass.:
25173.95
Organism:
Hepatitis C virus
Description:
Q8JXU8
Residue:
229
  
Inhibitor
Name:
BDBM50137478
Synonyms:
1-Cyclohexyl-1H-benzoimidazole-2,5-dicarboxylic acid 2-ethyl ester | CHEMBL177701
Type:
Small organic molecule
Emp. Form.:
C17H20N2O4
Mol. Mass.:
316.3517
SMILES:
CCOC(=O)c1nc2cc(ccc2n1C1CCCCC1)C(O)=O
: