Target
RNA-directed RNA polymerase
Ligand
BDBM50137475
Substrate
Meas. Tech.
ChEBML_143777
IC50
1800±n/a nM
Citation
 Beaulieu, PLBös, MBousquet, YFazal, GGauthier, JGillard, JGoulet, SLaPlante, SPoupart, MALefebvre, SMcKercher, GPellerin, CAustel, VKukolj, G Non-nucleoside inhibitors of the hepatitis C virus NS5B polymerase: discovery and preliminary SAR of benzimidazole derivatives. Bioorg Med Chem Lett 14:119-24 (2003)  
Target
Name:
RNA-directed RNA polymerase
Synonyms:
Hepatitis C virus NS5B RNA-dependent RNA polymerase | NS5B protein
Type:
Protein
Mol. Mass.:
25173.95
Organism:
Hepatitis C virus
Description:
Q8JXU8
Residue:
229
  
Inhibitor
Name:
BDBM50137475
Synonyms:
1-Cyclohexyl-2-(1-methyl-1H-pyrrol-2-yl)-1H-benzoimidazole-5-carboxylic acid | CHEMBL368168
Type:
Small organic molecule
Emp. Form.:
C19H21N3O2
Mol. Mass.:
323.3889
SMILES:
Cn1cccc1-c1nc2cc(ccc2n1C1CCCCC1)C(O)=O
: