Target
RNA-directed RNA polymerase
Ligand
BDBM50137505
Substrate
Meas. Tech.
ChEBML_143777
IC50
139000±n/a nM
Citation
 Beaulieu, PLBös, MBousquet, YFazal, GGauthier, JGillard, JGoulet, SLaPlante, SPoupart, MALefebvre, SMcKercher, GPellerin, CAustel, VKukolj, G Non-nucleoside inhibitors of the hepatitis C virus NS5B polymerase: discovery and preliminary SAR of benzimidazole derivatives. Bioorg Med Chem Lett 14:119-24 (2003)  
Target
Name:
RNA-directed RNA polymerase
Synonyms:
Hepatitis C virus NS5B RNA-dependent RNA polymerase | NS5B protein
Type:
Protein
Mol. Mass.:
25173.95
Organism:
Hepatitis C virus
Description:
Q8JXU8
Residue:
229
  
Inhibitor
Name:
BDBM50137505
Synonyms:
1-(1-Ethyl-propyl)-2-pyridin-2-yl-1H-benzoimidazole-5-carboxylic acid | CHEMBL175762
Type:
Small organic molecule
Emp. Form.:
C18H19N3O2
Mol. Mass.:
309.3624
SMILES:
CCC(CC)n1c(nc2cc(ccc12)C(O)=O)-c1ccccn1
: