Target
RNA-directed RNA polymerase
Ligand
BDBM50137501
Substrate
Meas. Tech.
ChEBML_143777
IC50
>30000±n/a nM
Citation
 Beaulieu, PLBös, MBousquet, YFazal, GGauthier, JGillard, JGoulet, SLaPlante, SPoupart, MALefebvre, SMcKercher, GPellerin, CAustel, VKukolj, G Non-nucleoside inhibitors of the hepatitis C virus NS5B polymerase: discovery and preliminary SAR of benzimidazole derivatives. Bioorg Med Chem Lett 14:119-24 (2003)  
Target
Name:
RNA-directed RNA polymerase
Synonyms:
Hepatitis C virus NS5B RNA-dependent RNA polymerase | NS5B protein
Type:
Protein
Mol. Mass.:
25173.95
Organism:
Hepatitis C virus
Description:
Q8JXU8
Residue:
229
  
Inhibitor
Name:
BDBM50137501
Synonyms:
1-Cyclohexyl-2-(5-methyl-thiophen-2-yl)-1H-benzoimidazole-5-carboxylic acid | CHEMBL176593
Type:
Small organic molecule
Emp. Form.:
C19H20N2O2S
Mol. Mass.:
340.439
SMILES:
Cc1ccc(s1)-c1nc2cc(ccc2n1C1CCCCC1)C(O)=O
: