Target
Genome polyprotein
Ligand
BDBM50137488
Substrate
Meas. Tech.
ChEBML_164133
IC50
>250000±n/a nM
Citation
 Beaulieu, PLBös, MBousquet, YFazal, GGauthier, JGillard, JGoulet, SLaPlante, SPoupart, MALefebvre, SMcKercher, GPellerin, CAustel, VKukolj, G Non-nucleoside inhibitors of the hepatitis C virus NS5B polymerase: discovery and preliminary SAR of benzimidazole derivatives. Bioorg Med Chem Lett 14:119-24 (2003)  
Target
Name:
Genome polyprotein
Synonyms:
POLG_POL1M | Poliovirus type 1 polyprotein
Type:
PROTEIN
Mol. Mass.:
246555.04
Organism:
Poliovirus type 1 (strain Mahoney)
Description:
ChEMBL_417449
Residue:
2209
  
Inhibitor
Name:
BDBM50137488
Synonyms:
1-Cyclohexyl-2-furan-3-yl-1H-benzoimidazole-5-carboxylic acid 1-cyclohexyl-2-furan-3-yl-1H-benzimidazole-5-carboxylic acid | CHEMBL175177
Type:
Small organic molecule
Emp. Form.:
C18H18N2O3
Mol. Mass.:
310.3471
SMILES:
OC(=O)c1ccc2n(C3CCCCC3)c(nc2c1)-c1ccoc1
: