Target
DNA-directed RNA polymerase subunit beta
Ligand
BDBM50137481
Substrate
Meas. Tech.
ChEBML_164130
IC50
>500000±n/a nM
Citation
 Beaulieu, PLBös, MBousquet, YFazal, GGauthier, JGillard, JGoulet, SLaPlante, SPoupart, MALefebvre, SMcKercher, GPellerin, CAustel, VKukolj, G Non-nucleoside inhibitors of the hepatitis C virus NS5B polymerase: discovery and preliminary SAR of benzimidazole derivatives. Bioorg Med Chem Lett 14:119-24 (2003)  
Target
Name:
DNA-directed RNA polymerase subunit beta
Synonyms:
Bacterial DNA-directed RNA polymerase DNA-directed RNA polymerase subunit beta RNA polymerase subunit beta (β-RNAP) RPOB_ECOLI groN rif rpoB stv | tabD
Type:
Enzyme
Mol. Mass.:
150595.80
Organism:
Escherichia coli
Description:
P0A8V2
Residue:
1342
  
Inhibitor
Name:
BDBM50137481
Synonyms:
1-Cyclohexyl-2-(1H-imidazol-2-yl)-1H-benzoimidazole-5-carboxylic acid | CHEMBL426227
Type:
Small organic molecule
Emp. Form.:
C17H18N4O2
Mol. Mass.:
310.3504
SMILES:
OC(=O)c1ccc2n(C3CCCCC3)c(nc2c1)-c1ncc[nH]1
: