Target
Genome polyprotein
Ligand
BDBM50137963
Substrate
Meas. Tech.
ChEBML_143470
IC50
110±n/a nM
Citation
 Goudreau, NCameron, DRBonneau, PGorys, VPlouffe, CPoirier, MLamarre, DLlinas-Brunet, M NMR structural characterization of peptide inhibitors bound to the Hepatitis C virus NS3 protease: design of a new P2 substituent. J Med Chem 47:123-32 (2003)  
Target
Name:
Genome polyprotein
Synonyms:
Hepatitis C virus NS3 protease/helicase | Hepatitis C virus serine protease, NS3/NS4A
Type:
Protein
Mol. Mass.:
67067.41
Organism:
Hepatitis C virus
Description:
A3EZI9
Residue:
631
  
Inhibitor
Name:
BDBM50137963
Synonyms:
(1R,2S)-1-((3R,5S)-1-((S)-2-((S)-2-acetamido-2-cyclohexylacetamido)-3-methylbutanoyl)-3-(quinolin-4-yloxy)pyrrolidine-5-carboxamido)-2-vinylcyclopropanecarboxylic acid CHEMBL175190
Type:
Small organic molecule
Emp. Form.:
C35H45N5O7
Mol. Mass.:
647.7611
SMILES:
CC(C)[C@H](NC(=O)[C@@H](NC(C)=O)C1CCCCC1)C(=O)N1C[C@@H](C[C@H]1C(=O)N[C@@]1(C[C@H]1C=C)C(O)=O)Oc1ccnc2ccccc12
: