Target
Melanocyte-stimulating hormone receptor
Ligand
BDBM50134495
Substrate
Meas. Tech.
ChEBML_105990
IC50
153±n/a nM
Citation
 Xi, NHale, CKelly, MGNorman, MHStec, MXu, SBaumgartner, JWFotsch, C Synthesis of novel melanocortin 4 receptor agonists and antagonists containing a succinamide core. Bioorg Med Chem Lett 14:377-81 (2003)  
Target
Name:
Melanocyte-stimulating hormone receptor
Synonyms:
MC1-R Mc1r Melanocyte-stimulating hormone receptor | Msh-r
Type:
PROTEIN
Mol. Mass.:
35238.60
Organism:
Mus musculus
Description:
ChEMBL_1498846
Residue:
315
  
Inhibitor
Name:
BDBM50134495
Synonyms:
1'-[3-(4-chlorophenyl)-2-[(3R)-1,2-dihydro-3-isoquinolinylcarboxamido]-(2R)-propanoyl]-1-methylsulfonylspiro[2,3-dihydro-1H-indole-3,4'-(hexahydropyridine)] CHEMBL338768
Type:
Small organic molecule
Emp. Form.:
C32H35ClN4O4S
Mol. Mass.:
607.163
SMILES:
CS(=O)(=O)N1CC2(CCN(CC2)C(=O)[C@@H](Cc2ccc(Cl)cc2)NC(=O)[C@H]2Cc3ccccc3CN2)c2ccccc12
: