Target
Melanocyte-stimulating hormone receptor
Ligand
BDBM50138300
Substrate
Meas. Tech.
ChEBML_105990
IC50
>1400±n/a nM
Citation
 Xi, NHale, CKelly, MGNorman, MHStec, MXu, SBaumgartner, JWFotsch, C Synthesis of novel melanocortin 4 receptor agonists and antagonists containing a succinamide core. Bioorg Med Chem Lett 14:377-81 (2003)  
Target
Name:
Melanocyte-stimulating hormone receptor
Synonyms:
MC1-R Mc1r Melanocyte-stimulating hormone receptor | Msh-r
Type:
PROTEIN
Mol. Mass.:
35238.60
Organism:
Mus musculus
Description:
ChEMBL_1498846
Residue:
315
  
Inhibitor
Name:
BDBM50138300
Synonyms:
CHEMBL127861 | N-[1-(2-{4-[(S)-4-Azetidin-1-yl-2-(4-chloro-benzyl)-4-oxo-butyryl]-piperazin-1-yl}-phenyl)-ethyl]-N-ethyl-acetamide
Type:
Small organic molecule
Emp. Form.:
C30H39ClN4O3
Mol. Mass.:
539.109
SMILES:
CCN(C(C)c1ccccc1N1CCN(CC1)C(=O)[C@H](CC(=O)N1CCC1)Cc1ccc(Cl)cc1)C(C)=O
: