Target
Melanocyte-stimulating hormone receptor
Ligand
BDBM50223719
Substrate
Meas. Tech.
ChEMBL_105990 (CHEMBL716347)
IC50
0.060000±n/a nM
Citation
 Xi, NHale, CKelly, MGNorman, MHStec, MXu, SBaumgartner, JWFotsch, C Synthesis of novel melanocortin 4 receptor agonists and antagonists containing a succinamide core. Bioorg Med Chem Lett 14:377-81 (2003)  
Target
Name:
Melanocyte-stimulating hormone receptor
Synonyms:
MC1-R Mc1r Melanocyte-stimulating hormone receptor | Msh-r
Type:
PROTEIN
Mol. Mass.:
35238.60
Organism:
Mus musculus
Description:
ChEMBL_1498846
Residue:
315
  
Inhibitor
Name:
BDBM50223719
Synonyms:
CHEMBL3348530
Type:
Small organic molecule
Emp. Form.:
C48H66N14O9
Mol. Mass.:
983.126
SMILES:
CCCC[C@H](N)C(=O)N[C@H]1CC(=O)NCCCC[C@H](NC(=O)[C@H](Cc2c[nH]c3ccccc23)NC(=O)[C@H](CCCN=C(N)N)NC(=O)[C@@H](Cc2ccccc2)NC(=O)[C@H](Cc2c[nH]cn2)NC1=O)C(O)=O
: