Target
Cathepsin K
Ligand
BDBM50138851
Substrate
Meas. Tech.
ChEMBL_48338 (CHEMBL663327)
IC50
1700±n/a nM
Citation
 Tavares, FXBoncek, VDeaton, DNHassell, AMLong, STMiller, ABPayne, AAMiller, LRShewchuk, LMWells-Knecht, KWillard, DHWright, LLZhou, HQ Design of potent, selective, and orally bioavailable inhibitors of cysteine protease cathepsin k. J Med Chem 47:588-99 (2004)  
Target
Name:
Cathepsin K
Synonyms:
CATK_RAT | Ctsk
Type:
PROTEIN
Mol. Mass.:
36798.82
Organism:
Rattus norvegicus
Description:
ChEMBL_633322
Residue:
329
  
Inhibitor
Name:
BDBM50138851
Synonyms:
CHEMBL152633 | [(S)-1-(2-Methyl-2H-pyrazol-3-ylaminooxalyl)-pentyl]-carbamic acid 1-isopropyl-2-methyl-propyl ester
Type:
Small organic molecule
Emp. Form.:
C19H32N4O4
Mol. Mass.:
380.4818
SMILES:
CCCC[C@H](NC(=O)OC(C(C)C)C(C)C)C(=O)C(=O)Nc1ccnn1C
: