Target
Cathepsin K
Ligand
BDBM50138873
Substrate
Meas. Tech.
ChEMBL_45540 (CHEMBL656670)
IC50
360±n/a nM
Citation
 Tavares, FXBoncek, VDeaton, DNHassell, AMLong, STMiller, ABPayne, AAMiller, LRShewchuk, LMWells-Knecht, KWillard, DHWright, LLZhou, HQ Design of potent, selective, and orally bioavailable inhibitors of cysteine protease cathepsin k. J Med Chem 47:588-99 (2004)  
Target
Name:
Cathepsin K
Synonyms:
CATK_HUMAN CTSO Cathepsin O Cathepsin X
Type:
Enzyme
Mol. Mass.:
36975.68
Organism:
Homo sapiens (Human)
Description:
P43235
Residue:
329
  
Inhibitor
Name:
BDBM50138873
Synonyms:
CHEMBL433890 | {(S)-1-Methyl-2-oxo-2-[(thiophen-2-ylmethyl)-carbamoyl]-ethyl}-carbamic acid 1-isopropyl-2-methyl-propyl ester
Type:
Small organic molecule
Emp. Form.:
C17H26N2O4S
Mol. Mass.:
354.464
SMILES:
CC(C)C(OC(=O)N[C@@H](C)C(=O)C(=O)NCc1cccs1)C(C)C
: