Target
Cathepsin K
Ligand
BDBM50138872
Substrate
Meas. Tech.
ChEMBL_45540 (CHEMBL656670)
IC50
39±n/a nM
Citation
 Tavares, FXBoncek, VDeaton, DNHassell, AMLong, STMiller, ABPayne, AAMiller, LRShewchuk, LMWells-Knecht, KWillard, DHWright, LLZhou, HQ Design of potent, selective, and orally bioavailable inhibitors of cysteine protease cathepsin k. J Med Chem 47:588-99 (2004)  
Target
Name:
Cathepsin K
Synonyms:
CATK_HUMAN CTSO Cathepsin O Cathepsin X
Type:
Enzyme
Mol. Mass.:
36975.68
Organism:
Homo sapiens (Human)
Description:
P43235
Residue:
329
  
Inhibitor
Name:
BDBM50138872
Synonyms:
CHEMBL346739 | [(S)-1-(2-Isobutyl-2H-pyrazol-3-ylaminooxalyl)-pentyl]-carbamic acid 1-isopropyl-2-methyl-propyl ester
Type:
Small organic molecule
Emp. Form.:
C22H38N4O4
Mol. Mass.:
422.5615
SMILES:
CCCC[C@H](NC(=O)OC(C(C)C)C(C)C)C(=O)C(=O)Nc1ccnn1CC(C)C
: