Target
Integrin alpha-4/beta-1
Ligand
BDBM50139092
Substrate
Meas. Tech.
ChEMBL_88913 (CHEMBL699815)
IC50
11±n/a nM
Citation
 Dyatkin, ABHoekstra, WJKinney, WAKontoyianni, MSantulli, RJKimball, ESFisher, MCCarolyn Fisher, MProuty, SMAbraham, WMde Garavilla, LAndrade-Gordon, PHlasta, DJHe, WHornby, PJDamiano, BPMaryanoff, BE Aza-bicyclic amino acid sulfonamides as alpha(4)beta(1)/alpha(4)beta(7) integrin antagonists. Bioorg Med Chem Lett 14:591-6 (2004)  
Target
Name:
Integrin alpha-4/beta-1
Synonyms:
Fibronectin receptor beta/Integrin alpha-4 | Integrin alpha-4/beta-1
Type:
Mol. Mass.:
Description:
ASSAY_ID of EBI is 88912
Components:
This complex has 2 components.
Component 1
Name:
Integrin beta-1
Synonyms:
CD_antigen=CD29 Fibronectin receptor beta GPIIA ITGB1 MDF2 | MSK12
Type:
Enzyme
Mol. Mass.:
88400.38
Organism:
Homo sapiens (Human)
Description:
P05556
Residue:
798
  
Component 2
Name:
Integrin alpha-4
Synonyms:
CD49 antigen-like family member D CD49d antigen ITA4_HUMAN Integrin alpha-4 Integrin alpha-IV VLA-4 integrin alpha 4 precursor | integrin alpha-4 precursor
Type:
Membrane Protein
Mol. Mass.:
114897.35
Organism:
Homo sapiens (Human)
Description:
P13612
Residue:
1032
  
Inhibitor
Name:
BDBM50139092
Synonyms:
(S)-2-{[2-(5-Chloro-thiophene-2-sulfonyl)-2-aza-bicyclo[2.2.2]octane-3-carbonyl]-amino}-3-{4-[(2,6-dichloro-pyridine-4-carbonyl)-amino]-phenyl}-propionic acid | CHEMBL415540
Type:
Small organic molecule
Emp. Form.:
C27H25Cl3N4O6S2
Mol. Mass.:
672
SMILES:
OC(=O)[C@H](Cc1ccc(NC(=O)c2cc(Cl)nc(Cl)c2)cc1)NC(=O)C1C2CCC(CC2)N1S(=O)(=O)c1ccc(Cl)s1
: