Target
Integrin alpha-4/beta-1
Ligand
BDBM17223
Substrate
Meas. Tech.
ChEMBL_88913 (CHEMBL699815)
IC50
12±n/a nM
Citation
 Dyatkin, ABHoekstra, WJKinney, WAKontoyianni, MSantulli, RJKimball, ESFisher, MCCarolyn Fisher, MProuty, SMAbraham, WMde Garavilla, LAndrade-Gordon, PHlasta, DJHe, WHornby, PJDamiano, BPMaryanoff, BE Aza-bicyclic amino acid sulfonamides as alpha(4)beta(1)/alpha(4)beta(7) integrin antagonists. Bioorg Med Chem Lett 14:591-6 (2004)  
Target
Name:
Integrin alpha-4/beta-1
Synonyms:
Fibronectin receptor beta/Integrin alpha-4 | Integrin alpha-4/beta-1
Type:
Mol. Mass.:
Description:
ASSAY_ID of EBI is 88912
Components:
This complex has 2 components.
Component 1
Name:
Integrin beta-1
Synonyms:
CD_antigen=CD29 Fibronectin receptor beta GPIIA ITGB1 MDF2 | MSK12
Type:
Enzyme
Mol. Mass.:
88400.38
Organism:
Homo sapiens (Human)
Description:
P05556
Residue:
798
  
Component 2
Name:
Integrin alpha-4
Synonyms:
CD49 antigen-like family member D CD49d antigen ITA4_HUMAN Integrin alpha-4 Integrin alpha-IV VLA-4 integrin alpha 4 precursor | integrin alpha-4 precursor
Type:
Membrane Protein
Mol. Mass.:
114897.35
Organism:
Homo sapiens (Human)
Description:
P13612
Residue:
1032
  
Inhibitor
Name:
BDBM17223
Synonyms:
(2S)-2-{[(3S)-2-(benzenesulfonyl)-2-azabicyclo[2.2.2]octan-3-yl]formamido}-3-{4-[(2,6-dichloropyridine-4-)amido]phenyl}propanoic acid CHEMBL156420
Type:
Small organic molecule
Emp. Form.:
C29H28Cl2N4O6S
Mol. Mass.:
631.527
SMILES:
OC(=O)[C@H](Cc1ccc(NC(=O)c2cc(Cl)nc(Cl)c2)cc1)NC(=O)[C@@H]1C2CCC(CC2)N1S(=O)(=O)c1ccccc1
: