Target
Integrin alpha-IIb/beta-3
Ligand
BDBM50139204
Substrate
Meas. Tech.
ChEMBL_218095 (CHEMBL822542)
EC50
>100000±n/a nM
Citation
 Vianello, PCozzi, PGalvani, AMeroni, MVarasi, MVolpi, DBandiera, T Solid-phase synthesis of a small library of 3-phenylthio-3-nicotinyl propionic acid derivatives acting as antagonists of the integrin alphaVbeta3. Bioorg Med Chem Lett 14:657-61 (2004)  
Target
Name:
Integrin alpha-IIb/beta-3
Synonyms:
Glycoprotein IIb/IIIa
Type:
Mol. Mass.:
Description:
ASSAY_ID of EBI is 30109
Components:
This complex has 2 components.
Component 1
Name:
Integrin beta-3
Synonyms:
CD_antigen=CD61 GPIIIa ITGB3 Platelet membrane glycoprotein IIIa
Type:
Protein
Mol. Mass.:
87038.91
Organism:
Homo sapiens (Human)
Description:
P05106
Residue:
788
  
Component 2
Name:
Integrin alpha-IIb
Synonyms:
CD_antigen=CD41 GPIIb Glycoprotein IIb ITGA2B Integrin alpha-IIb heavy chain Integrin alpha-IIb light chain, form 2 Integrin alpha-V/beta-3 and alpha-IIb/beta 3 | Platelet membrane glycoprotein IIb
Type:
Protein
Mol. Mass.:
113354.85
Organism:
Homo sapiens (Human)
Description:
P08514
Residue:
1039
  
Inhibitor
Name:
BDBM50139204
Synonyms:
3-[4-(3-Guanidino-benzoylamino)-phenylsulfanyl]-3-pyridin-3-yl-propionic acid | CHEMBL350668
Type:
Small organic molecule
Emp. Form.:
C22H21N5O3S
Mol. Mass.:
435.499
SMILES:
[#7]\[#6](-[#7])=[#7]/c1cccc(c1)-[#6](=O)-[#7]-c1ccc(-[#16]-[#6](-[#6]-[#6](-[#8])=O)-c2cccnc2)cc1
: