Target
Prostaglandin G/H synthase 1
Ligand
BDBM50074933
Substrate
Meas. Tech.
ChEMBL_159424 (CHEMBL873414)
Ki
130±n/a nM
Citation
 Gupta, KKaub, CJCarey, KNCasillas, EGSelinsky, BSLoll, PJ Manipulation of kinetic profiles in 2-aryl propionic acid cyclooxygenase inhibitors. Bioorg Med Chem Lett 14:667-71 (2004)  
Target
Name:
Prostaglandin G/H synthase 1
Synonyms:
COX1 Cyclooxygenase-1 (COX-1) PTGS1 | Prostaglandin G/H synthase (cyclooxygenase)
Type:
Protein
Mol. Mass.:
68868.60
Organism:
Ovis aries (Sheep)
Description:
Residue:
600
  
Inhibitor
Name:
BDBM50074933
Synonyms:
2-biphenyl-4-yl-propionic acid alpha-Methyl-4-biphenyl-acetic acid
Type:
Small organic molecule
Emp. Form.:
C15H14O2
Mol. Mass.:
226.2705
SMILES:
CC(C(O)=O)c1ccc(cc1)-c1ccccc1
: