Target
Prothrombin
Ligand
BDBM50228853
Substrate
Meas. Tech.
ChEMBL_208309 (CHEMBL812829)
Ki
0.2±n/a nM
Citation
 Maryanoff, BE Inhibitors of serine proteases as potential therapeutic agents: the road from thrombin to tryptase to cathepsin G. J Med Chem 47:769-87 (2004)  
Target
Name:
Prothrombin
Synonyms:
Activation peptide fragment 1 Coagulation factor II Prothrombin precursor Thrombin heavy chain | Thrombin light chain
Type:
Protein
Mol. Mass.:
70029.57
Organism:
Homo sapiens (Human)
Description:
P00734
Residue:
622
  
Inhibitor
Name:
BDBM50228853
Synonyms:
(S)-1-((R)-2-Methylamino-3-phenyl-propionyl)-pyrrolidine-2-carboxylic acid [(S)-1-(benzothiazole-2-carbonyl)-4-guanidino-butyl]-amide CHEMBL270437 | RWJ-50353
Type:
Small organic molecule
Emp. Form.:
C28H35N7O3S
Mol. Mass.:
549.688
SMILES:
[#6]-[#7]-[#6@H](-[#6]-c1ccccc1)-[#6](=O)-[#7]-1-[#6]-[#6]-[#6]-[#6@H]-1-[#6](=O)-[#7]-[#6@@H](-[#6]-[#6]-[#6]\[#7]=[#6](\[#7])-[#7])-[#6](=O)-c1nc2ccccc2s1
: