Target
Prothrombin
Ligand
BDBM14129
Substrate
Meas. Tech.
ChEMBL_208309 (CHEMBL812829)
Ki
2±n/a nM
Citation
 Maryanoff, BE Inhibitors of serine proteases as potential therapeutic agents: the road from thrombin to tryptase to cathepsin G. J Med Chem 47:769-87 (2004)  
Target
Name:
Prothrombin
Synonyms:
Activation peptide fragment 1 Coagulation factor II Prothrombin precursor Thrombin heavy chain | Thrombin light chain
Type:
Protein
Mol. Mass.:
70029.57
Organism:
Homo sapiens (Human)
Description:
P00734
Residue:
622
  
Inhibitor
Name:
BDBM14129
Synonyms:
2-[(2S)-5-carbamimidamido-2-{[(2S)-1-[(2R)-2-(methylamino)-3-phenylpropanoyl]pyrrolidin-2-yl]formamido}pentanoyl]-1,3-benzothiazole-6-carboxylic acid CHEMBL403929 | RWJ-51438
Type:
Small organic molecule
Emp. Form.:
C29H35N7O5S
Mol. Mass.:
593.697
SMILES:
[#6]-[#7]-[#6@H](-[#6]-c1ccccc1)-[#6](=O)-[#7]-1-[#6]-[#6]-[#6]-[#6@H]-1-[#6](=O)-[#7]-[#6@@H](-[#6]-[#6]-[#6]\[#7]=[#6](\[#7])-[#7])-[#6](=O)-c1nc2ccc(cc2s1)-[#6](-[#8])=O
: