Target
Type-1 angiotensin II receptor
Ligand
BDBM50009714
Substrate
Meas. Tech.
ChEMBL_36795 (CHEMBL650315)
IC50
28±n/a nM
Citation
 Bondensgaard, KAnkersen, MThøgersen, HHansen, BSWulff, BSBywater, RP Recognition of privileged structures by G-protein coupled receptors. J Med Chem 47:888-99 (2004)  
Target
Name:
Type-1 angiotensin II receptor
Synonyms:
AGTR1 AGTR1B AT1 AT1BR AT2R1B Angiotensin II receptor Type-1 angiotensin II receptor (AT1)
Type:
Protein
Mol. Mass.:
41080.75
Organism:
Homo sapiens (Human)
Description:
P30556
Residue:
359
  
Inhibitor
Name:
BDBM50009714
Synonyms:
CHEMBL191 | {2-Butyl-5-chloro-3-[2'-(2H-tetrazol-5-yl)-biphenyl-4-ylmethyl]-4,5-dihydro-3H-imidazol-4-yl}-methanol(DuP 753)
Type:
Small organic molecule
Emp. Form.:
C22H25ClN6O
Mol. Mass.:
424.927
SMILES:
CCCCC1=NC(Cl)C(CO)N1Cc1ccc(cc1)-c1ccccc1-c1nnn[nH]1
: