Target
5-hydroxytryptamine receptor 6
Ligand
BDBM50139789
Substrate
Meas. Tech.
ChEMBL_3609 (CHEMBL618092)
IC50
0.7±n/a nM
Citation
 Bondensgaard, KAnkersen, MThøgersen, HHansen, BSWulff, BSBywater, RP Recognition of privileged structures by G-protein coupled receptors. J Med Chem 47:888-99 (2004)  
Target
Name:
5-hydroxytryptamine receptor 6
Synonyms:
5-HT-6 5-hydroxytryptamine receptor 6 (5-HT-6) 5-hydroxytryptamine receptor 6 (5HT6) HTR6 Serotonin 6 (5-HT6) receptor | Serotonin Receptor 6
Type:
G Protein-Coupled Receptor (GPCR)
Mol. Mass.:
46968.43
Organism:
Homo sapiens (Human)
Description:
P50406
Residue:
440
  
Inhibitor
Name:
BDBM50139789
Synonyms:
CHEMBL353389 | {3-[2-(3-Bromo-phenyl)-1H-indol-3-yl]-propyl}-dimethyl-amine
Type:
Small organic molecule
Emp. Form.:
C19H21BrN2
Mol. Mass.:
357.287
SMILES:
CN(C)CCCc1c([nH]c2ccccc12)-c1cccc(Br)c1
: