Target
Sodium-dependent noradrenaline transporter
Ligand
BDBM50139959
Substrate
Meas. Tech.
ChEMBL_144970 (CHEMBL753703)
Ki
111±n/a nM
Citation
 Plisson, CMcConathy, JMartarello, LMalveaux, EJCamp, VMWilliams, LVotaw, JRGoodman, MM Synthesis, radiosynthesis, and biological evaluation of carbon-11 and iodine-123 labeled 2beta-carbomethoxy-3beta-[4'-((Z)-2-haloethenyl)phenyl]tropanes: candidate radioligands for in vivo imaging of the serotonin transporter. J Med Chem 47:1122-35 (2004)  
Target
Name:
Sodium-dependent noradrenaline transporter
Synonyms:
Monoamine transporter NET Noradrenaline Transporter (NET) Norepinephrine transporter protein (NET) SLC6A2 Sodium-dependent noradrenaline transporter (NET) | Solute carrier family 6 member 2
Type:
Multi-pass membrane protein
Mol. Mass.:
69337.72
Organism:
Homo sapiens (Human)
Description:
P23975
Residue:
617
  
Inhibitor
Name:
BDBM50139959
Synonyms:
3-[4-((Z)-2-Bromo-vinyl)-phenyl]-8-methyl-8-aza-bicyclo[3.2.1]octane-2-carboxylic acid methyl ester | CHEMBL14305
Type:
Small organic molecule
Emp. Form.:
C18H22BrNO2
Mol. Mass.:
364.277
SMILES:
COC(=O)C1C2CCC(CC1c1ccc(\C=C/Br)cc1)N2C
: