Target
Melatonin receptor type 1A
Ligand
BDBM50452033
Substrate
Meas. Tech.
ChEBML_105100
Ki
0.050000±n/a nM
Citation
 Sun, LQChen, JTakaki, KJohnson, GIben, LMahle, CDRyan, EXu, C Design and synthesis of benzoxazole derivatives as novel melatoninergic ligands. Bioorg Med Chem Lett 14:1197-200 (2004)  
Target
Name:
Melatonin receptor type 1A
Synonyms:
MTNR1A MTR1A_HUMAN Mel1a melatonin receptor Melatonin receptor Melatonin receptor type 1 (MT1) | Melatonin receptor type 1A
Type:
Enzyme
Mol. Mass.:
39392.94
Organism:
Homo sapiens (Human)
Description:
P48039
Residue:
350
  
Inhibitor
Name:
BDBM50452033
Synonyms:
CHEMBL2112690
Type:
Small organic molecule
Emp. Form.:
C24H28N2O2
Mol. Mass.:
376.4913
SMILES:
CCC(=O)NC[C@@H]1C[C@H]1c1cccc2nc(CCCCc3ccccc3)oc12
: