Target
Melatonin receptor type 1B
Ligand
BDBM50140302
Substrate
Meas. Tech.
ChEBML_105264
Ki
0.140000±n/a nM
Citation
 Sun, LQChen, JTakaki, KJohnson, GIben, LMahle, CDRyan, EXu, C Design and synthesis of benzoxazole derivatives as novel melatoninergic ligands. Bioorg Med Chem Lett 14:1197-200 (2004)  
Target
Name:
Melatonin receptor type 1B
Synonyms:
MTNR1B Mel-1B-R Melatonin 1B Melatonin receptor type 1B | Melatonin receptor type 2 (MT2)
Type:
Enzyme
Mol. Mass.:
40203.54
Organism:
Homo sapiens (Human)
Description:
P49286
Residue:
362
  
Inhibitor
Name:
BDBM50140302
Synonyms:
CHEMBL279343 | Cyclopropanecarboxylic acid [(1R,2R)-2-(2-propyl-2,3-dihydro-benzooxazol-7-yl)-cyclopropylmethyl]-amide
Type:
Small organic molecule
Emp. Form.:
C18H24N2O2
Mol. Mass.:
300.3954
SMILES:
CCCC1Nc2cccc([C@@H]3C[C@H]3CNC(=O)C3CC3)c2O1
: