Target
Prostaglandin G/H synthase 2
Ligand
BDBM50078688
Substrate
Meas. Tech.
ChEMBL_159913 (CHEMBL768962)
IC50
230±n/a nM
Citation
 Riendeau, DSalem, MStyhler, AOuellet, MMancini, JALi, CS Evaluation of loxoprofen and its alcohol metabolites for potency and selectivity of inhibition of cyclooxygenase-2. Bioorg Med Chem Lett 14:1201-3 (2004)  
Target
Name:
Prostaglandin G/H synthase 2
Synonyms:
COX2 Cyclooxygenase 2 (COX-2) Cyclooxygenase-2 (COX-2 AA) Cyclooxygenase-2 (COX-2) PGH2_HUMAN PHS II Prostaglandin E synthase/G/H synthase 2 Prostaglandin-endoperoxide synthase 2
Type:
Enzyme
Mol. Mass.:
69003.89
Organism:
Homo sapiens (Human)
Description:
Recombinant Cox-2 provided by Cayman (Cayman Chemical Co.,Ann Arbor, MI).
Residue:
604
  
Inhibitor
Name:
BDBM50078688
Synonyms:
3-(3,4-Difluoro-phenyl)-4-(4-methanesulfonyl-phenyl)-5H-furan-2-one CHEMBL18264
Type:
Small organic molecule
Emp. Form.:
C17H12F2O4S
Mol. Mass.:
350.337
SMILES:
CS(=O)(=O)c1ccc(cc1)C1=C(C(=O)OC1)c1ccc(F)c(F)c1
: