Target
Prostaglandin G/H synthase 1
Ligand
BDBM50140317
Substrate
Meas. Tech.
ChEMBL_158932 (CHEMBL768837)
IC50
20200±n/a nM
Citation
 Riendeau, DSalem, MStyhler, AOuellet, MMancini, JALi, CS Evaluation of loxoprofen and its alcohol metabolites for potency and selectivity of inhibition of cyclooxygenase-2. Bioorg Med Chem Lett 14:1201-3 (2004)  
Target
Name:
Prostaglandin G/H synthase 1
Synonyms:
COX-1 Cyclooxygenase Cyclooxygenase-1 (COX-1) PTGS1 | Prostaglandin G/H synthase (cyclooxygenase)
Type:
Enzyme
Mol. Mass.:
68692.62
Organism:
Homo sapiens (Human)
Description:
P23219
Residue:
599
  
Inhibitor
Name:
BDBM50140317
Synonyms:
(R)-2-[4-((1R,2S)-2-Hydroxy-cyclopentylmethyl)-phenyl]-propionic acid | CHEMBL417452
Type:
Small organic molecule
Emp. Form.:
C15H20O3
Mol. Mass.:
248.3175
SMILES:
C[C@@H](C(O)=O)c1ccc(C[C@H]2CCC[C@@H]2O)cc1
: