Target
Dipeptidyl peptidase 4
Ligand
BDBM12191
Substrate
Meas. Tech.
ChEBML_53340
IC50
320±n/a nM
Citation
 Caldwell, CGChen, PHe, JParmee, ERLeiting, BMarsilio, FPatel, RAWu, JKEiermann, GJPetrov, AHe, HLyons, KAThornberry, NAWeber, AE Fluoropyrrolidine amides as dipeptidyl peptidase IV inhibitors. Bioorg Med Chem Lett 14:1265-8 (2004)  
Target
Name:
Dipeptidyl peptidase 4
Synonyms:
ADABP Adenosine deaminase complexing protein 2 CD_antigen=CD26 DPP4 DPPIV Dipeptidyl peptidase 4 (DPP IV) Dipeptidyl peptidase 4 (DPP4) Dipeptidyl peptidase 4 membrane form Dipeptidyl peptidase IV Dipeptidyl peptidase IV (DDP-IV) Dipeptidyl peptidase IV membrane form Dipeptidyl peptidase-IV (DPP-4) T-cell activation antigen CD26 | TP103
Type:
Enzyme
Mol. Mass.:
88271.01
Organism:
Homo sapiens (Human)
Description:
P27487
Residue:
766
  
Inhibitor
Name:
BDBM12191
Synonyms:
(2S)-2-amino-2-cyclohexyl-1-(pyrrolidin-1-yl)ethan-1-one (S)-2-amino-2-cyclohexyl-1-(pyrrolidin-1-yl)ethanone isoquinoline derivative 14
Type:
Small organic molecule
Emp. Form.:
C12H22N2O
Mol. Mass.:
210.3159
SMILES:
N[C@@H](C1CCCCC1)C(=O)N1CCCC1
: