Target
Genome polyprotein/Non-structural protein 4A
Ligand
BDBM50141199
Substrate
Meas. Tech.
ChEMBL_143644 (CHEMBL752803)
Ki
200±n/a nM
Citation
 Perni, RBPitlik, JBritt, SDCourt, JJCourtney, LFDeininger, DDFarmer, LJGates, CAHarbeson, SLLevin, RBLin, CLin, KMoon, YCLuong, YPO'Malley, ETRao, BGThomson, JATung, RDVan Drie, JHWei, Y Inhibitors of hepatitis C virus NS3.4A protease 2. Warhead SAR and optimization. Bioorg Med Chem Lett 14:1441-6 (2004)  
Target
Name:
Genome polyprotein/Non-structural protein 4A
Synonyms:
Hepatitis C virus serine protease, NS3/NS4A
Type:
Mol. Mass.:
Description:
ASSAY_ID of ChEMBL is 1969955
Components:
This complex has 2 components.
Component 1
Name:
Non-structural protein 4A
Synonyms:
Hepatitis C virus NS4A protein Non-structural protein 4A
Type:
PROTEIN
Mol. Mass.:
5762.65
Organism:
Hepatitis C virus
Description:
ChEMBL_305334
Residue:
54
  
Component 2
Name:
Genome polyprotein
Synonyms:
Hepatitis C virus NS3 protease/helicase | Hepatitis C virus serine protease, NS3/NS4A
Type:
Protein
Mol. Mass.:
67067.41
Organism:
Hepatitis C virus
Description:
A3EZI9
Residue:
631
  
Inhibitor
Name:
BDBM50141199
Synonyms:
3,4-Dihydro-1H-isoquinoline-2-carboxylic acid 5-[(S,R)-1-(1-carboxy-ethylaminooxalyl)-butylcarbamoyl]-1-((R)-3-methyl-2-{(R)-3-methyl-2-[(pyrazine-2-carbonyl)-amino]-butyrylamino}-butyryl)-pyrrolidin-3-yl ester | CHEMBL423300
Type:
Small organic molecule
Emp. Form.:
C39H52N8O10
Mol. Mass.:
792.8778
SMILES:
CCCC(NC(=O)[C@@H]1C[C@H](CN1C(=O)[C@H](NC(=O)[C@H](NC(=O)c1cnccn1)C(C)C)C(C)C)OC(=O)N1CCc2ccccc2C1)C(=O)C(=O)NC(C)C(O)=O
: